Reaction Details
TargetFocal adhesion kinase 1
LigandBDBM50449315
Substrate/Competitorn/a
Meas. Tech.ChEMBL_1296445 (CHEMBL3130285)
IC50>50000±n/a nM
Citation Zhao, HCaflisch, A Discovery of dual ZAP70 and Syk kinases inhibitors by docking into a rare C-helix-out conformation of Syk. Bioorg Med Chem Lett24:1523-7 (2014) 
 
Focal adhesion kinase 1
Name:Focal adhesion kinase 1
Type:Tyrosine-protein kinase
Mol. Mass.:119233.17
Organism:Homo sapiens (Human)
Description:Q05397
Residue:1052
BDBM50449315
NameBDBM50449315
Synonyms:CHEMBL3125863
TypeSmall organic molecule
Emp. Form.C21H16F2N4O2S
Mol. Mass.426.439
SMILESFc1ccc(Cc2cnc(NC(=O)CCc3nc4ccccc4c(=O)[nH]3)s2)cc1F