Reaction Details
TargetNeuropeptide Y receptor type 5
LigandBDBM50449320
Substrate/Competitorn/a
Meas. Tech.ChEMBL_1296657 (CHEMBL3131566)
Ki 10.0±n/a nM
Citation Burns, JFChen, BChen, CADoller, DEdelmenky, EJiang, YPeterson, JMSabio, MWeiss, JWhite, ADWu, LBhardwaj, RChandrasena, GBoyle, NJHuang, X cis-1-Oxo-heterocyclyl-4-amido cyclohexane derivatives as NPY5 receptor antagonists. Bioorg Med Chem Lett24:1458-61 (2014) 
 
Neuropeptide Y receptor type 5
Name:Neuropeptide Y receptor type 5
Type:Enzyme
Mol. Mass.:50746.64
Organism:Homo sapiens (Human)
Description:Q15761
Residue:445
BDBM50449320
NameBDBM50449320
Synonyms:CHEMBL3126050
TypeSmall organic molecule
Emp. Form.C23H26F2N4O2
Mol. Mass.428.4749
SMILESCCN1CCN([C@H]2CC[C@H](CC2)C(=O)Nc2ccc(cn2)-c2cc(F)cc(F)c2)C1=O