Reaction Details
TargetNeuropeptide Y receptor type 5
LigandBDBM50449321
Substrate/Competitorn/a
Meas. Tech.ChEMBL_1296657 (CHEMBL3131566)
Ki 9.0±n/a nM
Citation Burns, JFChen, BChen, CADoller, DEdelmenky, EJiang, YPeterson, JMSabio, MWeiss, JWhite, ADWu, LBhardwaj, RChandrasena, GBoyle, NJHuang, X cis-1-Oxo-heterocyclyl-4-amido cyclohexane derivatives as NPY5 receptor antagonists. Bioorg Med Chem Lett24:1458-61 (2014) 
 
Neuropeptide Y receptor type 5
Name:Neuropeptide Y receptor type 5
Type:Enzyme
Mol. Mass.:50746.64
Organism:Homo sapiens (Human)
Description:Q15761
Residue:445
BDBM50449321
NameBDBM50449321
Synonyms:CHEMBL3126052
TypeSmall organic molecule
Emp. Form.C24H26F2N4O2
Mol. Mass.440.4856
SMILESFc1cc(F)cc(c1)-c1ccc(NC(=O)[C@@H]2CC[C@@H](CC2)N2CCN(C3CC3)C2=O)nc1