Reaction Details
TargetNeuropeptide Y receptor type 5
LigandBDBM50449332
Substrate/Competitorn/a
Meas. Tech.ChEMBL_1296657 (CHEMBL3131566)
Ki 2.0±n/a nM
Citation Burns, JFChen, BChen, CADoller, DEdelmenky, EJiang, YPeterson, JMSabio, MWeiss, JWhite, ADWu, LBhardwaj, RChandrasena, GBoyle, NJHuang, X cis-1-Oxo-heterocyclyl-4-amido cyclohexane derivatives as NPY5 receptor antagonists. Bioorg Med Chem Lett24:1458-61 (2014) 
 
Neuropeptide Y receptor type 5
Name:Neuropeptide Y receptor type 5
Type:Enzyme
Mol. Mass.:50746.64
Organism:Homo sapiens (Human)
Description:Q15761
Residue:445
BDBM50449332
NameBDBM50449332
Synonyms:CHEMBL3126041
TypeSmall organic molecule
Emp. Form.C23H25F2N3O2
Mol. Mass.413.4603
SMILESFc1cc(F)cc(c1)-c1ccc(NC(=O)[C@@H]2CC[C@@H](CC2)N2CCCCC2=O)nc1