Reaction Details
TargetHexokinase-4
LigandBDBM50161674
Substrate/Competitorn/a
Meas. Tech.ChEMBL_1297748 (CHEMBL3131380)
EC50 26700±n/a nM
Citation Li, YTian, KQin, AZhang, LHuo, LLei, LShen, ZSong, HFeng, Z Discovery of novel urea derivatives as dual-target hypoglycemic agents that activate glucokinase and PPAR¿. Eur J Med Chem76:182-92 (2014) 
 
Hexokinase-4
Name:Hexokinase-4
Type:Enzyme
Mol. Mass.:52175.81
Organism:Homo sapiens (Human)
Description:P35557
Residue:465
BDBM50161674
NameBDBM50161674
Synonyms:3-Cyclopentyl-2-(4-methanesulfonyl-phenyl)-N-thiazol-2-yl-propionamide | CHEMBL359618
TypeSmall organic molecule
Emp. Form.C18H22N2O3S2
Mol. Mass.378.509
SMILESCS(=O)(=O)c1ccc(cc1)C(CC1CCCC1)C(=O)Nc1nccs1