Reaction Details
TargetPresequence protease, mitochondrial
LigandBDBM50449405
Substrate/Competitorn/a
Meas. Tech.ChEMBL_1294272 (CHEMBL3128914)
EC50 152±n/a nM
Citation Vangavaragu, JRValasani, KRGan, XYan, SS Identification of human presequence protease (hPreP) agonists for the treatment of Alzheimer's disease. Eur J Med Chem76:506-16 (2014) 
 
Presequence protease, mitochondrial
Name:Presequence protease, mitochondrial
Type:PROTEIN
Mol. Mass.:117419.85
Organism:Homo sapiens (Human)
Description:ChEMBL_108043
Residue:1037
BDBM50449405
NameBDBM50449405
Synonyms:CHEMBL3127264
TypeSmall organic molecule
Emp. Form.C20H13Br2N3O4
Mol. Mass.519.143
SMILESOc1ccc(Br)cc1Cn1c(nc2ccc(cc12)[N+]([O-])=O)-c1cc(Br)ccc1O