Reaction Details
TargetcAMP-specific 3',5'-cyclic phosphodiesterase 4D
LigandBDBM50450771
Substrate/Competitorn/a
Meas. Tech.ChEBML_155182
IC50 8.80±n/a nM
Citation Bacher, EBoer, CBray-French, KDemnitz, FWKeller, THMazzoni, LMüller, TWalker, C N-arylrolipram derivatives as potent and selective PDE4 inhibitors. Bioorg Med Chem Lett8:3229-34 (1999) cAMP-specific 3',5'-cyclic phosphodiesterase 4D
Name:cAMP-specific 3',5'-cyclic phosphodiesterase 4D
Type:Protein
Mol. Mass.:91092.69
Organism:Homo sapiens (Human)
Description:Q08499
Residue:809
BDBM50450771
NameBDBM50450771
Synonyms:CHEMBL326655
TypeSmall organic molecule
Emp. Form.C33H39N3O6
Mol. Mass.573.6793
SMILESCOc1cccc(COc2cc(cc(c2)C(=O)NN(C)C)N2CC(CC2=O)c2ccc(OC)c(OC3CCCC3)c2)c1