Reaction Details
TargetCoagulation factor X
LigandBDBM13662
Substrate/Competitorn/a
Meas. Tech.ChEBML_48815
Ki 10.0±n/a nM
Citation Nazaré, MMatter, HKlingler, OAl-Obeidi, FSchreuder, HZoller, GCzech, JLorenz, MDudda, APeyman, ANestler, HPUrmann, MBauer, ALaux, VWehner, VWill, DW Novel factor Xa inhibitors based on a benzoic acid scaffold and incorporating a neutral P1 ligand. Bioorg Med Chem Lett14:2801-5 (2004) 
 
Coagulation factor X
Name:Coagulation factor X
Type:Enzyme
Mol. Mass.:54726.60
Organism:Homo sapiens (Human)
Description:n/a
Residue:488
BDBM13662
NameBDBM13662
Synonyms:3-Oxybenzamide 48 | 4-chloro-3-[2-(2,4-dichlorophenyl)ethoxy]-5-methoxy-N-{[1-(pyridin-4-yl)piperidin-4-yl]methyl}benzamide
TypeSmall organic molecule
Emp. Form.C27H28Cl3N3O3
Mol. Mass.548.889
SMILESCOc1cc(cc(OCCc2ccc(Cl)cc2Cl)c1Cl)C(=O)NCC1CCN(CC1)c1ccncc1