Reaction Details
TargetCoagulation factor X
LigandBDBM13629
Substrate/Competitorn/a
Meas. Tech.ChEBML_48815
Ki 71±n/a nM
Citation Nazaré, MMatter, HKlingler, OAl-Obeidi, FSchreuder, HZoller, GCzech, JLorenz, MDudda, APeyman, ANestler, HPUrmann, MBauer, ALaux, VWehner, VWill, DW Novel factor Xa inhibitors based on a benzoic acid scaffold and incorporating a neutral P1 ligand. Bioorg Med Chem Lett14:2801-5 (2004) 
 
Coagulation factor X
Name:Coagulation factor X
Type:Enzyme
Mol. Mass.:54726.60
Organism:Homo sapiens (Human)
Description:n/a
Residue:488
BDBM13629
NameBDBM13629
Synonyms:3-Oxybenzamide 15 | 3-[2-(4-bromophenyl)ethoxy]-4-fluoro-N-{[1-(pyridin-4-yl)piperidin-4-yl]methyl}benzamide
TypeSmall organic molecule
Emp. Form.C26H27BrFN3O2
Mol. Mass.512.414
SMILESFc1ccc(cc1OCCc1ccc(Br)cc1)C(=O)NCC1CCN(CC1)c1ccncc1