Reaction Details
TargetCoagulation factor X
LigandBDBM13631
Substrate/Competitorn/a
Meas. Tech.ChEBML_48815
Ki 206±n/a nM
Citation Nazaré, MMatter, HKlingler, OAl-Obeidi, FSchreuder, HZoller, GCzech, JLorenz, MDudda, APeyman, ANestler, HPUrmann, MBauer, ALaux, VWehner, VWill, DW Novel factor Xa inhibitors based on a benzoic acid scaffold and incorporating a neutral P1 ligand. Bioorg Med Chem Lett14:2801-5 (2004) 
 
Coagulation factor X
Name:Coagulation factor X
Type:Enzyme
Mol. Mass.:54726.60
Organism:Homo sapiens (Human)
Description:n/a
Residue:488
BDBM13631
NameBDBM13631
Synonyms:3-Oxybenzamide 17 | 4-fluoro-3-[2-(4-methylphenyl)ethoxy]-N-{[1-(pyridin-4-yl)piperidin-4-yl]methyl}benzamide
TypeSmall organic molecule
Emp. Form.C27H30FN3O2
Mol. Mass.447.5444
SMILESCc1ccc(CCOc2cc(ccc2F)C(=O)NCC2CCN(CC2)c2ccncc2)cc1