Reaction Details
TargetCoagulation factor X
LigandBDBM13668
Substrate/Competitorn/a
Meas. Tech.ChEBML_48815
Ki 13±n/a nM
Citation Nazaré, MMatter, HKlingler, OAl-Obeidi, FSchreuder, HZoller, GCzech, JLorenz, MDudda, APeyman, ANestler, HPUrmann, MBauer, ALaux, VWehner, VWill, DW Novel factor Xa inhibitors based on a benzoic acid scaffold and incorporating a neutral P1 ligand. Bioorg Med Chem Lett14:2801-5 (2004) 
 
Coagulation factor X
Name:Coagulation factor X
Type:Enzyme
Mol. Mass.:54726.60
Organism:Homo sapiens (Human)
Description:n/a
Residue:488
BDBM13668
NameBDBM13668
Synonyms:3-Oxybenzamide 54 | 4-chloro-3-[2-(4-chlorophenyl)ethoxy]-N-{[1-(pyridin-4-yl)piperidin-4-yl]methyl}benzamide
TypeSmall organic molecule
Emp. Form.C26H27Cl2N3O2
Mol. Mass.484.417
SMILESClc1ccc(CCOc2cc(ccc2Cl)C(=O)NCC2CCN(CC2)c2ccncc2)cc1