Reaction Details
TargetCoagulation factor X
LigandBDBM50452118
Substrate/Competitorn/a
Meas. Tech.ChEBML_48815
Ki 950±n/a nM
Citation Nazaré, MMatter, HKlingler, OAl-Obeidi, FSchreuder, HZoller, GCzech, JLorenz, MDudda, APeyman, ANestler, HPUrmann, MBauer, ALaux, VWehner, VWill, DW Novel factor Xa inhibitors based on a benzoic acid scaffold and incorporating a neutral P1 ligand. Bioorg Med Chem Lett14:2801-5 (2004) 
 
Coagulation factor X
Name:Coagulation factor X
Type:Enzyme
Mol. Mass.:54726.60
Organism:Homo sapiens (Human)
Description:n/a
Residue:488
BDBM50452118
NameBDBM50452118
Synonyms:CHEMBL421560
TypeSmall organic molecule
Emp. Form.C28H31Cl2N3O4
Mol. Mass.544.469
SMILESCOc1ccc(cc1OCCc1ccc(Cl)cc1Cl)C(=O)NCC1CCN(Cc2ccnc(O)c2)CC1