Reaction Details
TargetCoagulation factor X
LigandBDBM13673
Substrate/Competitorn/a
Meas. Tech.ChEBML_48815
Ki 57±n/a nM
Citation Nazaré, MMatter, HKlingler, OAl-Obeidi, FSchreuder, HZoller, GCzech, JLorenz, MDudda, APeyman, ANestler, HPUrmann, MBauer, ALaux, VWehner, VWill, DW Novel factor Xa inhibitors based on a benzoic acid scaffold and incorporating a neutral P1 ligand. Bioorg Med Chem Lett14:2801-5 (2004) 
 
Coagulation factor X
Name:Coagulation factor X
Type:Enzyme
Mol. Mass.:54726.60
Organism:Homo sapiens (Human)
Description:n/a
Residue:488
BDBM13673
NameBDBM13673
Synonyms:3-Oxybenzamide 59 | 3-[2-(2,4-dichlorophenyl)ethoxy]-4-methoxy-N-{[1-(2-methylpyridin-4-yl)piperidin-4-yl]methyl}benzamide
TypeSmall organic molecule
Emp. Form.C28H31Cl2N3O3
Mol. Mass.528.47
SMILESCOc1ccc(cc1OCCc1ccc(Cl)cc1Cl)C(=O)NCC1CCN(CC1)c1ccnc(C)c1