Reaction Details
Target5-hydroxytryptamine receptor 3A/3B
LigandBDBM50062446
Substrate/Competitorn/a
Meas. Tech.ChEMBL_3039 (CHEMBL620657)
IC50 1.4±n/a nM
Citation Swain, CJBaker, RKneen, CMoseley, JSaunders, JSeward, EMStevenson, GBeer, MStanton, JWatling, K Novel 5-HT3 antagonists. Indole oxadiazoles. J Med Chem34:140-51 (1991) 5-hydroxytryptamine receptor 3A/3B
Name:5-hydroxytryptamine receptor 3A/3B
Type:n/a
Mol. Mass.:n/a
Description:ASSAY_ID of EBI is 2974
Components:This complex has 2 components.
Component 1
Name:5-hydroxytryptamine receptor 3B
Synonyms:5HT3B_RAT Serotonin (5-HT) receptor
Type:PROTEIN
Mol. Mass.:50328.78
Organism:Rattus norvegicus
Description:EBI_11885
Residue:437
Component 2
Name:5-hydroxytryptamine receptor 3A
Synonyms:5-HT3 5HT3A_RAT Htr3 Serotonin (5-HT) receptor | Zacopride site-R
Type:Enzyme Catalytic Domain
Mol. Mass.:55428.70
Organism:RAT
Description:5-HT3 HTR3A RAT::P35563
Residue:483
BDBM50062446
NameBDBM50062446
Synonyms:3-[3-(1-Methyl-1H-indol-3-yl)-[1,2,4]oxadiazol-5-yl]-1-aza-bicyclo[2.2.2]octane | CHEMBL291031
TypeSmall organic molecule
Emp. Form.C18H20N4O
Mol. Mass.308.3776
SMILESCn1cc(-c2noc(n2)C2CN3CCC2CC3)c2ccccc12