Reaction Details
TargetGlycogen phosphorylase, muscle form
LigandBDBM50454688
Substrate/Competitorn/a
Meas. Tech.ChEMBL_70989 (CHEMBL680567)
Ki 38905±n/a nM
Citation Pastor, MCruciani, GWatson, KA A strategy for the incorporation of water molecules present in a ligand binding site into a three-dimensional quantitative structure--activity relationship analysis. J Med Chem40:4089-102 (1998) 
 
Glycogen phosphorylase, muscle form
Name:Glycogen phosphorylase, muscle form
Type:PROTEIN
Mol. Mass.:97097.45
Organism:Homo sapiens (Human)
Description:ChEMBL_1449751
Residue:842
BDBM50454688
NameBDBM50454688
Synonyms:CHEMBL32811
TypeSmall organic molecule
Emp. Form.C8H12N2O8
Mol. Mass.264.1895
SMILESOCC1OC2(NC(=O)N(O)C2=O)C(O)C(O)C1O