Reaction Details
TargetGlycogen phosphorylase, muscle form
LigandBDBM50057731
Substrate/Competitorn/a
Meas. Tech.ChEMBL_70989 (CHEMBL680567)
Ki 4800000±n/a nM
Citation Pastor, MCruciani, GWatson, KA A strategy for the incorporation of water molecules present in a ligand binding site into a three-dimensional quantitative structure--activity relationship analysis. J Med Chem40:4089-102 (1998) 
 
Glycogen phosphorylase, muscle form
Name:Glycogen phosphorylase, muscle form
Type:PROTEIN
Mol. Mass.:97097.45
Organism:Homo sapiens (Human)
Description:ChEMBL_1449751
Residue:842
BDBM50057731
NameBDBM50057731
Synonyms:(2-Carbamoyl-3,4,5-trihydroxy-6-hydroxymethyl-tetrahydro-pyran-2-yl)-carbamic acid methyl ester | CHEMBL133097
TypeSmall organic molecule
Emp. Form.C9H16N2O8
Mol. Mass.280.2319
SMILESCOC(=O)N[C@@]1(O[C@H](CO)[C@@H](O)[C@H](O)[C@H]1O)C(N)=O