Reaction Details
TargetGlycogen phosphorylase, muscle form
LigandBDBM50057725
Substrate/Competitorn/a
Meas. Tech.ChEMBL_70989 (CHEMBL680567)
Ki 346737±n/a nM
Citation Pastor, MCruciani, GWatson, KA A strategy for the incorporation of water molecules present in a ligand binding site into a three-dimensional quantitative structure--activity relationship analysis. J Med Chem40:4089-102 (1998) 
 
Glycogen phosphorylase, muscle form
Name:Glycogen phosphorylase, muscle form
Type:PROTEIN
Mol. Mass.:97097.45
Organism:Homo sapiens (Human)
Description:ChEMBL_1449751
Residue:842
BDBM50057725
NameBDBM50057725
Synonyms:(3,4,5-Trihydroxy-6-hydroxymethyl-tetrahydro-pyran-2-yl)-carbamic acid benzyl ester | CHEMBL335891
TypeSmall organic molecule
Emp. Form.C14H19NO7
Mol. Mass.313.3032
SMILES[H][C@@]1(NC(=O)OCc2ccccc2)O[C@H](CO)[C@@H](O)[C@H](O)[C@H]1O