Reaction Details
TargetPeroxisome proliferator-activated receptor gamma
LigandBDBM50418575
Substrate/Competitorn/a
Meas. Tech.ChEMBL_154529 (CHEMBL760250)
Ki 5.1±n/a nM
Citation Henke, BRBlanchard, SGBrackeen, MFBrown, KKCobb, JECollins, JLHarrington, WWHashim, MAHull-Ryde, EAKaldor, IKliewer, SALake, DHLeesnitzer, LMLehmann, JMLenhard, JMOrband-Miller, LAMiller, JFMook, RANoble, SAOliver, WParks, DJPlunket, KDSzewczyk, JRWillson, TM N-(2-Benzoylphenyl)-L-tyrosine PPARgamma agonists. 1. Discovery of a novel series of potent antihyperglycemic and antihyperlipidemic agents. J Med Chem41:5020-36 (1999) 
 
Peroxisome proliferator-activated receptor gamma
Name:Peroxisome proliferator-activated receptor gamma
Type:Nuclear Receptor
Mol. Mass.:57613.46
Organism:Homo sapiens (Human)
Description:P37231
Residue:505
BDBM50418575
NameBDBM50418575
Synonyms:CHEMBL358137
TypeSmall organic molecule
Emp. Form.C33H27N3O6
Mol. Mass.561.584
SMILESCN(CCOc1ccc(CC(Nc2cccc3C(=O)c4ccccc4C(=O)c23)C(O)=O)cc1)c1nc2ccccc2o1