Reaction Details
TargetPeroxisome proliferator-activated receptor alpha
LigandBDBM50085048
Substrate/Competitorn/a
Meas. Tech.ChEMBL_153702 (CHEMBL759328)
Ki<5500±n/a nM
Citation Henke, BRBlanchard, SGBrackeen, MFBrown, KKCobb, JECollins, JLHarrington, WWHashim, MAHull-Ryde, EAKaldor, IKliewer, SALake, DHLeesnitzer, LMLehmann, JMLenhard, JMOrband-Miller, LAMiller, JFMook, RANoble, SAOliver, WParks, DJPlunket, KDSzewczyk, JRWillson, TM N-(2-Benzoylphenyl)-L-tyrosine PPARgamma agonists. 1. Discovery of a novel series of potent antihyperglycemic and antihyperlipidemic agents. J Med Chem41:5020-36 (1999) 
 
Peroxisome proliferator-activated receptor alpha
Name:Peroxisome proliferator-activated receptor alpha
Type:Enzyme
Mol. Mass.:52222.08
Organism:Homo sapiens (Human)
Description:Q07869
Residue:468
BDBM50085048
NameBDBM50085048
Synonyms:(S)-2-(2-Benzoyl-phenylamino)-3-{4-[2-(methyl-pyridin-2-yl-amino)-ethoxy]-phenyl}-propionic acid 2-(2-Benzoyl-phenylamino)-3-{4-[2-(methyl-pyridin-2-yl-amino)-ethoxy]-phenyl}-propionic acid | CHEMBL434063
TypeSmall organic molecule
Emp. Form.C30H29N3O4
Mol. Mass.495.569
SMILESCN(CCOc1ccc(C[C@H](Nc2ccccc2C(=O)c2ccccc2)C(O)=O)cc1)c1ccccn1