Reaction Details
TargetPeroxisome proliferator-activated receptor gamma
LigandBDBM50418568
Substrate/Competitorn/a
Meas. Tech.ChEMBL_154529 (CHEMBL760250)
Ki 3.3±n/a nM
Citation Henke, BRBlanchard, SGBrackeen, MFBrown, KKCobb, JECollins, JLHarrington, WWHashim, MAHull-Ryde, EAKaldor, IKliewer, SALake, DHLeesnitzer, LMLehmann, JMLenhard, JMOrband-Miller, LAMiller, JFMook, RANoble, SAOliver, WParks, DJPlunket, KDSzewczyk, JRWillson, TM N-(2-Benzoylphenyl)-L-tyrosine PPARgamma agonists. 1. Discovery of a novel series of potent antihyperglycemic and antihyperlipidemic agents. J Med Chem41:5020-36 (1999) 
 
Peroxisome proliferator-activated receptor gamma
Name:Peroxisome proliferator-activated receptor gamma
Type:Nuclear Receptor
Mol. Mass.:57613.46
Organism:Homo sapiens (Human)
Description:P37231
Residue:505
BDBM50418568
NameBDBM50418568
Synonyms:CHEMBL146822
TypeSmall organic molecule
Emp. Form.C33H31N3O5
Mol. Mass.549.6163
SMILESCN(CCOc1ccc(CC(Nc2ccccc2C(=O)Cc2ccccc2)C(O)=O)cc1)c1nc2ccccc2o1