Reaction Details
TargetPeroxisome proliferator-activated receptor gamma
LigandBDBM50418563
Substrate/Competitorn/a
Meas. Tech.ChEMBL_154378 (CHEMBL758987)
EC50 9.1±n/a nM
Citation Henke, BRBlanchard, SGBrackeen, MFBrown, KKCobb, JECollins, JLHarrington, WWHashim, MAHull-Ryde, EAKaldor, IKliewer, SALake, DHLeesnitzer, LMLehmann, JMLenhard, JMOrband-Miller, LAMiller, JFMook, RANoble, SAOliver, WParks, DJPlunket, KDSzewczyk, JRWillson, TM N-(2-Benzoylphenyl)-L-tyrosine PPARgamma agonists. 1. Discovery of a novel series of potent antihyperglycemic and antihyperlipidemic agents. J Med Chem41:5020-36 (1999) 
 
Peroxisome proliferator-activated receptor gamma
Name:Peroxisome proliferator-activated receptor gamma
Type:Nuclear Receptor
Mol. Mass.:57613.46
Organism:Homo sapiens (Human)
Description:P37231
Residue:505
BDBM50418563
NameBDBM50418563
Synonyms:CHEMBL148301
TypeSmall organic molecule
Emp. Form.C36H37NO6
Mol. Mass.579.6821
SMILESCc1c(C)c2OC(C)(COc3ccc(C[C@H](Nc4ccccc4C(=O)c4ccccc4)C(O)=O)cc3)CCc2c(C)c1O