Reaction Details
TargetSubstance-P receptor
LigandBDBM50000228
Substrate/Competitorn/a
Meas. Tech.ChEMBL_205901 (CHEMBL814485)
Ki 3.2±n/a nM
Citation Genicot, CChristophe, BCollart, PGillard, MGoossens, LHénichart, JPLassoie, MAMoureau, FNeuwels, MNicolas, JMPasau, PQuéré, LRyckmans, TStiernet, FTaverne, TVan Keulen, BJ Discovery of orally bioavailable NK1 receptor antagonists. Bioorg Med Chem Lett13:437-42 (2003) Substance-P receptor
Name:Substance-P receptor
Type:G Protein-Coupled Receptor (GPCR)
Mol. Mass.:46254.43
Organism:Homo sapiens (Human)
Description:P25103
Residue:407
BDBM50000228
NameBDBM50000228
Synonyms:CHEMBL136504
TypeSmall organic molecule
Emp. Form.C19H22Cl2N2O
Mol. Mass.365.297
SMILESClc1cc(Cl)cc(COCC(N2CCNCC2)c2ccccc2)c1