Reaction Details
TargetSubstance-P receptor
LigandBDBM50000242
Substrate/Competitorn/a
Meas. Tech.ChEMBL_205901 (CHEMBL814485)
Ki 3.2±n/a nM
Citation Genicot, CChristophe, BCollart, PGillard, MGoossens, LHénichart, JPLassoie, MAMoureau, FNeuwels, MNicolas, JMPasau, PQuéré, LRyckmans, TStiernet, FTaverne, TVan Keulen, BJ Discovery of orally bioavailable NK1 receptor antagonists. Bioorg Med Chem Lett13:437-42 (2003) Substance-P receptor
Name:Substance-P receptor
Type:G Protein-Coupled Receptor (GPCR)
Mol. Mass.:46254.43
Organism:Homo sapiens (Human)
Description:P25103
Residue:407
BDBM50000242
NameBDBM50000242
Synonyms:CHEMBL342443
TypeSmall organic molecule
Emp. Form.C24H26F6N2O3
Mol. Mass.504.4653
SMILESC[C@H](OC[C@H](N1CCN(CC(O)=O)CC1)c1ccccc1)c1cc(cc(c1)C(F)(F)F)C(F)(F)F