Reaction Details
TargetGag-Pol polyprotein [489-587]
LigandBDBM50000664
Substrate/Competitorn/a
Meas. Tech.ChEMBL_158036 (CHEMBL768260)
Ki 0.34±n/a nM
Citation Doweyko, AM Three-dimensional pharmacophores from binding data. J Med Chem37:1769-78 (1994) Gag-Pol polyprotein [489-587]
Name:Gag-Pol polyprotein [489-587]
Type:Enzyme Subunit
Mol. Mass.:10781.16
Organism:Human immunodeficiency virus type 1
Description:P04585[489-587]
Residue:99
BDBM50000664
NameBDBM50000664
Synonyms:CHEMBL295414
TypeSmall organic molecule
Emp. Form.C35H42N2O8
Mol. Mass.618.7166
SMILESCC(C)(C)OC(=O)N[C@@H](Cc1ccccc1)[C@@H](O)CC(Cc1ccc(OCC(O)=O)cc1)C(=O)NC1[C@H](O)Cc2ccccc12