Reaction Details
TargetGag-Pol polyprotein [489-587]
LigandBDBM50009242
Substrate/Competitorn/a
Meas. Tech.ChEMBL_158036 (CHEMBL768260)
Ki 0.22±n/a nM
Citation Doweyko, AM Three-dimensional pharmacophores from binding data. J Med Chem37:1769-78 (1994) Gag-Pol polyprotein [489-587]
Name:Gag-Pol polyprotein [489-587]
Type:Enzyme Subunit
Mol. Mass.:10781.16
Organism:Human immunodeficiency virus type 1
Description:P04585[489-587]
Residue:99
BDBM50009242
NameBDBM50009242
Synonyms:CHEMBL48565 {1-[1-Benzyl-4-(2-benzyloxycarbonylamino-3-methyl-butyrylamino)-2,3-dihydroxy-5-phenyl-pentylcarbamoyl]-2-methyl-propyl}-carbamic acid benzyl ester
TypeSmall organic molecule
Emp. Form.C44H54N4O8
Mol. Mass.766.9216
SMILESCC(C)[C@H](NC(=O)OCc1ccccc1)C(=O)N[C@@H](Cc1ccccc1)[C@H](O)[C@H](O)[C@H](Cc1ccccc1)NC(=O)[C@@H](NC(=O)OCc1ccccc1)C(C)C