Reaction Details
Target5-hydroxytryptamine receptor 6
LigandBDBM86428
Substrate/Competitorn/a
Meas. Tech.ChEMBL_304014 (CHEMBL840097)
Ki 2.5±n/a nM
Citation López-Rodríguez, MLBenhamú, Bde la Fuente, TSanz, APardo, LCampillo, M A three-dimensional pharmacophore model for 5-hydroxytryptamine6 (5-HT6) receptor antagonists. J Med Chem48:4216-9 (2005) 
 
5-hydroxytryptamine receptor 6
Name:5-hydroxytryptamine receptor 6
Type:G Protein-Coupled Receptor (GPCR)
Mol. Mass.:46968.43
Organism:Homo sapiens (Human)
Description:P50406
Residue:440
BDBM86428
NameBDBM86428
Synonyms:SB-258585
TypeSmall organic molecule
Emp. Form.C18H22IN3O3S
Mol. Mass.487.355
SMILESCOc1ccc(NS(=O)(=O)c2ccc(I)cc2)cc1N1CCN(C)CC1