Reaction Details
Target5-hydroxytryptamine receptor 6
LigandBDBM50001824
Substrate/Competitorn/a
Meas. Tech.ChEMBL_304014 (CHEMBL840097)
Ki 0.79±n/a nM
Citation López-Rodríguez, MLBenhamú, Bde la Fuente, TSanz, APardo, LCampillo, M A three-dimensional pharmacophore model for 5-hydroxytryptamine6 (5-HT6) receptor antagonists. J Med Chem48:4216-9 (2005) 
 
5-hydroxytryptamine receptor 6
Name:5-hydroxytryptamine receptor 6
Type:G Protein-Coupled Receptor (GPCR)
Mol. Mass.:46968.43
Organism:Homo sapiens (Human)
Description:P50406
Residue:440
BDBM50001824
NameBDBM50001824
Synonyms:CHEMBL282971
TypeSmall organic molecule
Emp. Form.C23H26ClN3O3S2
Mol. Mass.492.054
SMILES[H][C@]12CCCN1CCN(C2)c1cc(NS(=O)(=O)c2sc3ccc(Cl)cc3c2C)ccc1OC