Reaction Details
Target5-hydroxytryptamine receptor 6
LigandBDBM50203139
Substrate/Competitorn/a
Meas. Tech.ChEMBL_304014 (CHEMBL840097)
Ki 32±n/a nM
Citation López-Rodríguez, MLBenhamú, Bde la Fuente, TSanz, APardo, LCampillo, M A three-dimensional pharmacophore model for 5-hydroxytryptamine6 (5-HT6) receptor antagonists. J Med Chem48:4216-9 (2005) 
 
5-hydroxytryptamine receptor 6
Name:5-hydroxytryptamine receptor 6
Type:G Protein-Coupled Receptor (GPCR)
Mol. Mass.:46968.43
Organism:Homo sapiens (Human)
Description:P50406
Residue:440
BDBM50203139
NameBDBM50203139
Synonyms:4-(1,2,3,4-Tetrahydro-carbazole-9-sulfonyl)-phenylamine CHEMBL365471
TypeSmall organic molecule
Emp. Form.C18H18N2O2S
Mol. Mass.326.413
SMILESNc1ccc(cc1)S(=O)(=O)n1c2CCCCc2c2ccccc12