Reaction Details
TargetDelta-type opioid receptor
LigandBDBM50001983
Substrate/Competitorn/a
Meas. Tech.ChEMBL_304038 (CHEMBL840216)
Ki 2.6±n/a nM
Citation Peng, YKeenan, SMZhang, QKholodovych, VWelsh, WJ 3D-QSAR comparative molecular field analysis on opioid receptor antagonists: pooling data from different studies. J Med Chem48:1620-9 (2005) 
 
Delta-type opioid receptor
Name:Delta-type opioid receptor
Type:G Protein-Coupled Receptor (GPCR)
Mol. Mass.:40465.04
Organism:Rattus norvegicus (rat)
Description:Competition binding assays were using CHO-K1 cell membranes expressing the opioid receptor.
Residue:372
BDBM50001983
NameBDBM50001983
Synonyms:CHEMBL364247
TypeSmall organic molecule
Emp. Form.C29H27ClN2O2
Mol. Mass.470.99
SMILES[H][C@@]12Oc3c4c(CC5N(CC6CC6)CCC14[C@@]5([H])Cc1cc(cnc21)-c1ccc(Cl)cc1)ccc3O