Reaction Details
TargetMu-type opioid receptor
LigandBDBM50002043
Substrate/Competitorn/a
Meas. Tech.ChEMBL_304036 (CHEMBL840214)
Ki 5.2±n/a nM
Citation Peng, YKeenan, SMZhang, QKholodovych, VWelsh, WJ 3D-QSAR comparative molecular field analysis on opioid receptor antagonists: pooling data from different studies. J Med Chem48:1620-9 (2005) 
 
Mu-type opioid receptor
Name:Mu-type opioid receptor
Type:G Protein-Coupled Receptor (GPCR)
Mol. Mass.:44503.11
Organism:Rattus norvegicus (rat)
Description:Competition binding assays were carried out using membrane preparations from transfected HN9.10 cells that constitutively expressed the mu opioid receptor.
Residue:398
BDBM50002043
NameBDBM50002043
Synonyms:CHEMBL425735
TypeSmall organic molecule
Emp. Form.C29H40N4O2
Mol. Mass.476.6535
SMILESCC1CN(CCCc2ccccc2)C2CC(CC1(C2)c1cccc(O)c1)NC(=O)CCNC(N)=C