Reaction Details
TargetKappa-type opioid receptor
LigandBDBM50002059
Substrate/Competitorn/a
Meas. Tech.ChEMBL_304044 (CHEMBL840221)
Ki 126±n/a nM
Citation Peng, YKeenan, SMZhang, QKholodovych, VWelsh, WJ 3D-QSAR comparative molecular field analysis on opioid receptor antagonists: pooling data from different studies. J Med Chem48:1620-9 (2005) 
 
Kappa-type opioid receptor
Name:Kappa-type opioid receptor
Type:G Protein-Coupled Receptor (GPCR)
Mol. Mass.:42744.99
Organism:Cavia porcellus (domestic guinea pig)
Description:P41144
Residue:380
BDBM50002059
NameBDBM50002059
Synonyms:CHEMBL606795
TypeSmall organic molecule
Emp. Form.C24H24N2O2
Mol. Mass.372.4596
SMILES[H][C@]12Oc3c4c(C[C@@]5([H])N(C)CC[C@@]14[C@@]5([H])C(C)c1c2[nH]c2ccccc12)ccc3O