Reaction Details
TargetDelta-type opioid receptor
LigandBDBM50002060
Substrate/Competitorn/a
Meas. Tech.ChEMBL_304038 (CHEMBL840216)
Ki 4.7±n/a nM
Citation Peng, YKeenan, SMZhang, QKholodovych, VWelsh, WJ 3D-QSAR comparative molecular field analysis on opioid receptor antagonists: pooling data from different studies. J Med Chem48:1620-9 (2005) 
 
Delta-type opioid receptor
Name:Delta-type opioid receptor
Type:G Protein-Coupled Receptor (GPCR)
Mol. Mass.:40465.04
Organism:Rattus norvegicus (rat)
Description:Competition binding assays were using CHO-K1 cell membranes expressing the opioid receptor.
Residue:372
BDBM50002060
NameBDBM50002060
Synonyms:CHEMBL606675
TypeSmall organic molecule
Emp. Form.C26H26N2O3
Mol. Mass.414.4962
SMILES[H][C@]12Oc3c4c(C[C@@]5([H])N(CC(C)=C)CC[C@@]14[C@@]5(O)Cc1c2[nH]c2ccccc12)ccc3O