Reaction Details
TargetDelta-type opioid receptor
LigandBDBM50001961
Substrate/Competitorn/a
Meas. Tech.ChEMBL_304038 (CHEMBL840216)
Ki 4.9±n/a nM
Citation Peng, YKeenan, SMZhang, QKholodovych, VWelsh, WJ 3D-QSAR comparative molecular field analysis on opioid receptor antagonists: pooling data from different studies. J Med Chem48:1620-9 (2005) 
 
Delta-type opioid receptor
Name:Delta-type opioid receptor
Type:G Protein-Coupled Receptor (GPCR)
Mol. Mass.:40465.04
Organism:Rattus norvegicus (rat)
Description:Competition binding assays were using CHO-K1 cell membranes expressing the opioid receptor.
Residue:372
BDBM50001961
NameBDBM50001961
Synonyms:CHEMBL195756
TypeSmall organic molecule
Emp. Form.C26H24N2O2
Mol. Mass.396.481
SMILES[H][C@@]12Oc3c4c(CC5N(C)CCC14[C@@]5([H])Cc1cc(cnc21)-c1ccccc1)ccc3O