Reaction Details
TargetKappa-type opioid receptor
LigandBDBM50002111
Substrate/Competitorn/a
Meas. Tech.ChEMBL_304044 (CHEMBL840221)
Ki 23±n/a nM
Citation Peng, YKeenan, SMZhang, QKholodovych, VWelsh, WJ 3D-QSAR comparative molecular field analysis on opioid receptor antagonists: pooling data from different studies. J Med Chem48:1620-9 (2005) 
 
Kappa-type opioid receptor
Name:Kappa-type opioid receptor
Type:G Protein-Coupled Receptor (GPCR)
Mol. Mass.:42744.99
Organism:Cavia porcellus (domestic guinea pig)
Description:P41144
Residue:380
BDBM50002111
NameBDBM50002111
Synonyms:CHEMBL371845
TypeSmall organic molecule
Emp. Form.C29H33NO3
Mol. Mass.443.5772
SMILESO=C1CC[C@@]2(OCCCc3ccccc3)C3Cc4cccc5OC1C2(CCN3CC1CC1)c45