Reaction Details
TargetSerine/threonine-protein kinase pim-1
LigandBDBM2695
Substrate/Competitorn/a
Meas. Tech.ChEMBL_326168 (CHEMBL864489)
Kd 12±n/a nM
Citation Bullock, ANDebreczeni, JEFedorov, OYNelson, AMarsden, BDKnapp, S Structural basis of inhibitor specificity of the human protooncogene proviral insertion site in moloney murine leukemia virus (PIM-1) kinase. J Med Chem48:7604-14 (2005) 
 
Serine/threonine-protein kinase pim-1
Name:Serine/threonine-protein kinase pim-1
Type:Protein
Mol. Mass.:35681.82
Organism:Homo sapiens (Human)
Description:P11309
Residue:313
BDBM2695
NameBDBM2695
Synonyms:3-[1-(3-aminopropyl)-1H-indol-3-yl]-4-(1-methyl-1H-indol-3-yl)-2,5-dihydro-1H-pyrrole-2,5-dione Bisindolylmaleimide VIII ROCHE screening, 49 | Ro 31-7549
TypeSmall organic molecule
Emp. Form.C24H22N4O2
Mol. Mass.398.4571
SMILESCn1cc(C2=C(C(=O)NC2=O)c2cn(CCCN)c3ccccc23)c2ccccc12