Reaction Details
TargetSerine/threonine-protein kinase pim-1
LigandBDBM11835
Substrate/Competitorn/a
Meas. Tech.ChEMBL_326168 (CHEMBL864489)
Kd 25±n/a nM
Citation Bullock, ANDebreczeni, JEFedorov, OYNelson, AMarsden, BDKnapp, S Structural basis of inhibitor specificity of the human protooncogene proviral insertion site in moloney murine leukemia virus (PIM-1) kinase. J Med Chem48:7604-14 (2005) 
 
Serine/threonine-protein kinase pim-1
Name:Serine/threonine-protein kinase pim-1
Type:Protein
Mol. Mass.:35681.82
Organism:Homo sapiens (Human)
Description:P11309
Residue:313
BDBM11835
NameBDBM11835
Synonyms:1-(3-{6-[(cyclopropylmethyl)amino]imidazo[1,2-a]pyridazin-3-yl}phenyl)ethan-1-one Cancer Res 676916 Compound K00135 | Imidazol[1,2-b]pyridazine 1
TypeSmall organic molecule
Emp. Form.C18H18N4O
Mol. Mass.306.3617
SMILESCC(=O)c1cccc(c1)-c1cnc2ccc(NCC3CC3)nn12