Reaction Details
TargetSerine/threonine-protein kinase pim-1
LigandBDBM2583
Substrate/Competitorn/a
Meas. Tech.ChEMBL_326168 (CHEMBL864489)
Kd 27±n/a nM
Citation Bullock, ANDebreczeni, JEFedorov, OYNelson, AMarsden, BDKnapp, S Structural basis of inhibitor specificity of the human protooncogene proviral insertion site in moloney murine leukemia virus (PIM-1) kinase. J Med Chem48:7604-14 (2005) 
 
Serine/threonine-protein kinase pim-1
Name:Serine/threonine-protein kinase pim-1
Type:Protein
Mol. Mass.:35681.82
Organism:Homo sapiens (Human)
Description:P11309
Residue:313
BDBM2583
NameBDBM2583
Synonyms:3,4-Bis(3-indolyl)-1H-pyrrole-2,5-dione BIM-4 Bisindolylmaleimide deriv. 5 bis-indolylmaleimide deriv. 8a
TypeSmall organic molecule
Emp. Form.C20H13N3O2
Mol. Mass.327.3361
SMILESO=C1NC(=O)C(=C1c1c[nH]c2ccccc12)c1c[nH]c2ccccc12