Reaction Details
TargetBeta-1 adrenergic receptor
LigandBDBM50002597
Substrate/Competitorn/a
Meas. Tech.ChEMBL_352669 (CHEMBL862149)
EC50 631±n/a nM
Citation Uehling, DEShearer, BGDonaldson, KHChao, EYDeaton, DNAdkison, KKBrown, KKCariello, NFFaison, WLLancaster, MELin, JHart, RMilliken, TOPaulik, MASherman, BWSugg, EECowan, C Biarylaniline phenethanolamines as potent and selective beta3 adrenergic receptor agonists. J Med Chem49:2758-71 (2006) 
 
Beta-1 adrenergic receptor
Name:Beta-1 adrenergic receptor
Type:G Protein-Coupled Receptor (GPCR)
Mol. Mass.:51338.40
Organism:Homo sapiens (Human)
Description:P08588
Residue:477
BDBM50002597
NameBDBM50002597
Synonyms:CHEMBL377028
TypeSmall organic molecule
Emp. Form.C24H25ClN2O3
Mol. Mass.424.92
SMILESC[C@H](CNc1cccc(c1)-c1ccccc1C(O)=O)NC[C@H](O)c1cccc(Cl)c1