Reaction Details
Target5-hydroxytryptamine receptor 2C
LigandBDBM50002623
Substrate/Competitorn/a
Meas. Tech.ChEMBL_384211 (CHEMBL868581)
Ki 10±n/a nM
Citation Micheli, FPasquarello, ATedesco, GHamprecht, DBonanomi, GChecchia, AJaxa-Chamiec, ADamiani, FDavalli, SDonati, DGallotti, CPetrone, MRinaldi, MRiley, GTerreni, SWood, M Diaryl substituted pyrrolidinones and pyrrolones as 5-HT2C inhibitors: synthesis and biological evaluation. Bioorg Med Chem Lett16:3906-12 (2006) 
 
5-hydroxytryptamine receptor 2C
Name:5-hydroxytryptamine receptor 2C
Type:G Protein-Coupled Receptor (GPCR)
Mol. Mass.:51836.79
Organism:Homo sapiens (Human)
Description:P28335
Residue:458
BDBM50002623
NameBDBM50002623
Synonyms:CHEMBL210059
TypeSmall organic molecule
Emp. Form.C25H30N2O4
Mol. Mass.422.5167
SMILESCOc1ccc(cc1)N1CC=C(C1=O)c1ccc(OC)c(OCCN2CCCCC2)c1