Reaction Details
TargetHistone deacetylase 1
LigandBDBM19149
Substrate/Competitorn/a
Meas. Tech.ChEMBL_422121 (CHEMBL908242)
IC50 113±n/a nM
Citation Mai, ARotili, DMassa, SBrosch, GSimonetti, GPassariello, CPalamara, AT Discovery of uracil-based histone deacetylase inhibitors able to reduce acquired antifungal resistance and trailing growth in Candida albicans. Bioorg Med Chem Lett17:1221-5 (2007) 
 
Histone deacetylase 1
Name:Histone deacetylase 1
Type:Protein
Mol. Mass.:55062.26
Organism:Mus musculus (Mouse)
Description:O09106
Residue:482
BDBM19149
NameBDBM19149
Synonyms:CHEMBL98 SAHA US10188756, Compound SAHA US11505523, Compound SAHA US9353061, SAHA US9695181, Vorinostat Zolinza suberoylanilide hydroxamic acid
TypeSmall organic molecule
Emp. Form.C14H20N2O3
Mol. Mass.264.3202
SMILESONC(=O)CCCCCCC(=O)Nc1ccccc1