Reaction Details
TargetHistone deacetylase
LigandBDBM50002747
Substrate/Competitorn/a
Meas. Tech.ChEMBL_422128 (CHEMBL908249)
IC50 11.3±n/a nM
Citation Mai, ARotili, DMassa, SBrosch, GSimonetti, GPassariello, CPalamara, AT Discovery of uracil-based histone deacetylase inhibitors able to reduce acquired antifungal resistance and trailing growth in Candida albicans. Bioorg Med Chem Lett17:1221-5 (2007) 
 
Histone deacetylase
Name:Histone deacetylase
Synonyms:Histone deacetylase HD1B
Type:PROTEIN
Mol. Mass.:50930.01
Organism:Zea mays
Description:ChEMBL_422128
Residue:458
BDBM50002747
NameBDBM50002747
Synonyms:CHEMBL217546
TypeSmall organic molecule
Emp. Form.C15H16ClN3O3S
Mol. Mass.353.824
SMILESONC(=O)CCCCSc1nc(cc(=O)[nH]1)-c1ccc(Cl)cc1