Reaction Details
TargetD(2) dopamine receptor
LigandBDBM50007422
Substrate/Competitorn/a
Meas. Tech.ChEMBL_430112 (CHEMBL919590)
EC50 25±n/a nM
Citation Saitton, SDel Tredici, ALMohell, NVollinga, RCBoström, DKihlberg, JLuthman, K Design, synthesis and evaluation of a PLG tripeptidomimetic based on a pyridine scaffold. J Med Chem47:6595-602 (2004) 
 
D(2) dopamine receptor
Name:D(2) dopamine receptor
Type:Cell-surface receptors
Mol. Mass.:50647.10
Organism:Homo sapiens (Human)
Description:P14416
Residue:443
BDBM50007422
NameBDBM50007422
Synonyms:(+)-6-Propyl-5,6,6a,7-tetrahydro-4H-dibenzo[de,g]quinoline-10,11-diol (R) 6-Propyl-5,6,6a,7-tetrahydro-4H-dibenzo[de,g]quinoline-10,11-diol (R)-6-propyl-5,6,6a,7-tetrahydro-4H-dibenzo[de,g]quinoline-10,11-diol 6-Propyl-5,6,6a,7-tetrahydro-4H-dibenzo[de,g]quinoline-10,11-diol CHEMBL538542 N-propylnorapomorphine-(+) | N-propylnorapomorphine-(-)
TypeSmall organic molecule
Emp. Form.C19H21NO2
Mol. Mass.295.3755
SMILESCCCN1CCc2cccc-3c2[C@H]1Cc1ccc(O)c(O)c-31