Reaction Details
TargetMuscarinic acetylcholine receptor M1
LigandBDBM50003014
Substrate/Competitorn/a
Meas. Tech.ChEMBL_461880 (CHEMBL929016)
Ki 30200±n/a nM
Citation Piergentili, AQuaglia, WGiannella, MDel Bello, FBuccioni, MNesi, MMatucci, R Rapid novel divergent synthesis and muscarinic agonist profile of all four optical isomers of N,N,N-trimethyl(6-methyl-1,4-dioxan-2-yl)methanaminium iodide. Bioorg Med Chem Lett18:614-8 (2008) 
 
Muscarinic acetylcholine receptor M1
Name:Muscarinic acetylcholine receptor M1
Type:Protein
Mol. Mass.:51442.54
Organism:Homo sapiens (Human)
Description:P11229
Residue:460
BDBM50003014
NameBDBM50003014
Synonyms:CHEMBL228144
TypeSmall organic molecule
Emp. Form.C9H20INO2
Mol. Mass.301.1651
SMILES[I-].CC1COCC(C[N+](C)(C)C)O1