Reaction Details
TargetMuscarinic acetylcholine receptor M3
LigandBDBM50003016
Substrate/Competitorn/a
Meas. Tech.ChEMBL_461882 (CHEMBL929018)
Ki 23442±n/a nM
Citation Piergentili, AQuaglia, WGiannella, MDel Bello, FBuccioni, MNesi, MMatucci, R Rapid novel divergent synthesis and muscarinic agonist profile of all four optical isomers of N,N,N-trimethyl(6-methyl-1,4-dioxan-2-yl)methanaminium iodide. Bioorg Med Chem Lett18:614-8 (2008) 
 
Muscarinic acetylcholine receptor M3
Name:Muscarinic acetylcholine receptor M3
Type:Enzyme
Mol. Mass.:66151.03
Organism:Homo sapiens (Human)
Description:P20309
Residue:590
BDBM50003016
NameBDBM50003016
Synonyms:CHEMBL227429
TypeSmall organic molecule
Emp. Form.C9H20INO2
Mol. Mass.301.1651
SMILES[I-].C[C@H]1COC[C@H](C[N+](C)(C)C)O1