Reaction Details
TargetMuscarinic acetylcholine receptor M1
LigandBDBM10759
Substrate/Competitorn/a
Meas. Tech.ChEMBL_461880 (CHEMBL929016)
Ki 13490±n/a nM
Citation Piergentili, AQuaglia, WGiannella, MDel Bello, FBuccioni, MNesi, MMatucci, R Rapid novel divergent synthesis and muscarinic agonist profile of all four optical isomers of N,N,N-trimethyl(6-methyl-1,4-dioxan-2-yl)methanaminium iodide. Bioorg Med Chem Lett18:614-8 (2008) 
 
Muscarinic acetylcholine receptor M1
Name:Muscarinic acetylcholine receptor M1
Type:Protein
Mol. Mass.:51442.54
Organism:Homo sapiens (Human)
Description:P11229
Residue:460
BDBM10759
NameBDBM10759
Synonyms:2-acetoxyethyl(trimethyl)ammonium;bromide CHEMBL667 [2-(acetyloxy)ethyl]trimethylazanium acetylcholine chloride | cid_6060
TypeSmall Organic Molecule
Emp. Form.C7H16NO2
Mol. Mass.146.2069
SMILESCC(=O)OCC[N+](C)(C)C