Reaction Details
TargetMuscarinic acetylcholine receptor M3
LigandBDBM50385682
Substrate/Competitorn/a
Meas. Tech.ChEMBL_461882 (CHEMBL929018)
Ki 3388±n/a nM
Citation Piergentili, AQuaglia, WGiannella, MDel Bello, FBuccioni, MNesi, MMatucci, R Rapid novel divergent synthesis and muscarinic agonist profile of all four optical isomers of N,N,N-trimethyl(6-methyl-1,4-dioxan-2-yl)methanaminium iodide. Bioorg Med Chem Lett18:614-8 (2008) 
 
Muscarinic acetylcholine receptor M3
Name:Muscarinic acetylcholine receptor M3
Type:Enzyme
Mol. Mass.:66151.03
Organism:Homo sapiens (Human)
Description:P20309
Residue:590
BDBM50385682
NameBDBM50385682
Synonyms:CHEMBL390842
TypeSmall organic molecule
Emp. Form.C9H20NO2
Mol. Mass.174.2601
SMILESC[C@H]1COC[C@@H](C[N+](C)(C)C)O1