Reaction Details
TargetMuscarinic acetylcholine receptor M2
LigandBDBM50003014
Substrate/Competitorn/a
Meas. Tech.ChEMBL_461881 (CHEMBL929017)
Ki 4890±n/a nM
Citation Piergentili, AQuaglia, WGiannella, MDel Bello, FBuccioni, MNesi, MMatucci, R Rapid novel divergent synthesis and muscarinic agonist profile of all four optical isomers of N,N,N-trimethyl(6-methyl-1,4-dioxan-2-yl)methanaminium iodide. Bioorg Med Chem Lett18:614-8 (2008) 
 
Muscarinic acetylcholine receptor M2
Name:Muscarinic acetylcholine receptor M2
Type:GPCR
Mol. Mass.:51730.61
Organism:Homo sapiens (Human)
Description:P08172
Residue:466
BDBM50003014
NameBDBM50003014
Synonyms:CHEMBL228144
TypeSmall organic molecule
Emp. Form.C9H20INO2
Mol. Mass.301.1651
SMILES[I-].CC1COCC(C[N+](C)(C)C)O1