Reaction Details
TargetPancreatic triacylglycerol lipase
LigandBDBM24567
Substrate/Competitorn/a
Meas. Tech.ChEMBL_527250 (CHEMBL972810)
IC50 80.7±n/a nM
Citation Jiang, WLi, WHan, LLiu, LZhang, QZhang, SNikaido, TKoike, K Biologically active triterpenoid saponins from Acanthopanax senticosus. J Nat Prod69:1577-81 (2006) 
 
Pancreatic triacylglycerol lipase
Name:Pancreatic triacylglycerol lipase
Type:PROTEIN
Mol. Mass.:51157.75
Organism:Homo sapiens (Human)
Description:ChEMBL_527250
Residue:465
BDBM24567
NameBDBM24567
Synonyms:(2S)-1-[(2S,3S)-3-hexyl-4-oxooxetan-2-yl]tridecan-2-yl (2S)-2-formamido-4-methylpentanoate Orlistat Tetrahydrolipstatin Xenical
TypeSmall organic molecule
Emp. Form.C29H53NO5
Mol. Mass.495.7348
SMILESCCCCCCCCCCC[C@@H](C[C@@H]1OC(=O)[C@H]1CCCCCC)OC(=O)[C@H](CC(C)C)NC=O