Reaction Details
TargetHistidine-rich protein PFHRP-II
LigandBDBM50003672
Substrate/Competitorn/a
Meas. Tech.ChEMBL_500704 (CHEMBL966920)
IC50 24400±n/a nM
Citation Sunduru, NSrivastava, KRajakumar, SPuri, SKSaxena, JKChauhan, PM Synthesis of novel thiourea, thiazolidinedione and thioparabanic acid derivatives of 4-aminoquinoline as potent antimalarials. Bioorg Med Chem Lett19:2570-3 (2009) 
 
Histidine-rich protein PFHRP-II
Name:Histidine-rich protein PFHRP-II
Type:PROTEIN
Mol. Mass.:35156.49
Organism:Plasmodium falciparum
Description:ChEMBL_500704
Residue:332
BDBM50003672
NameBDBM50003672
Synonyms:CHEMBL512078
TypeSmall organic molecule
Emp. Form.C18H19ClN4O2S
Mol. Mass.390.887
SMILESCCCC\N=C1/SC(=O)C(=O)N1CCNc1ccnc2cc(Cl)ccc12