Reaction Details
TargetHistidine-rich protein PFHRP-II
LigandBDBM50003680
Substrate/Competitorn/a
Meas. Tech.ChEMBL_500704 (CHEMBL966920)
IC50 21100±n/a nM
Citation Sunduru, NSrivastava, KRajakumar, SPuri, SKSaxena, JKChauhan, PM Synthesis of novel thiourea, thiazolidinedione and thioparabanic acid derivatives of 4-aminoquinoline as potent antimalarials. Bioorg Med Chem Lett19:2570-3 (2009) 
 
Histidine-rich protein PFHRP-II
Name:Histidine-rich protein PFHRP-II
Type:PROTEIN
Mol. Mass.:35156.49
Organism:Plasmodium falciparum
Description:ChEMBL_500704
Residue:332
BDBM50003680
NameBDBM50003680
Synonyms:CHEMBL512991
TypeSmall organic molecule
Emp. Form.C21H16Cl2N4O2S
Mol. Mass.459.348
SMILESClc1ccc2c(NCCCN3\C(SC(=O)C3=O)=N\c3ccccc3Cl)ccnc2c1